Reaction Details
TargetMuscarinic acetylcholine receptor M1
LigandBDBM50413132
Substrate/Competitorn/a
Meas. Tech.ChEMBL_496879 (CHEMBL998548)
IC50 10±n/a nM
Citation Jin, JWang, YShi, DWang, FFu, WDavis, RSJin, QFoley, JJSarau, HMMorrow, DMMoore, MLRivero, RAPalovich, MSalmon, MBelmonte, KEBusch-Petersen, J Muscarinic acetylcholine receptor antagonists: SAR and optimization of tyrosine ureas. Bioorg Med Chem Lett18:5481-6 (2008) 
 
Muscarinic acetylcholine receptor M1
Name:Muscarinic acetylcholine receptor M1
Type:Protein
Mol. Mass.:51442.54
Organism:Homo sapiens (Human)
Description:P11229
Residue:460
BDBM50413132
NameBDBM50413132
Synonyms:CHEMBL554918
TypeSmall organic molecule
Emp. Form.C39H41N4O7
Mol. Mass.677.7649
SMILESCCOC(=O)c1ccc(NC(=O)N[C@@H](Cc2ccc(cc2)C(=O)c2ccccc2)C(=O)N[C@H]2CC[N+](C)(Cc3ccc4OCOc4c3)C2)cc1