Reaction Details
TargetMuscarinic acetylcholine receptor M3
LigandBDBM50413109
Substrate/Competitorn/a
Meas. Tech.ChEMBL_496878 (CHEMBL998547)
Kd 0.02±n/a nM
Citation Jin, JWang, YShi, DWang, FFu, WDavis, RSJin, QFoley, JJSarau, HMMorrow, DMMoore, MLRivero, RAPalovich, MSalmon, MBelmonte, KEBusch-Petersen, J Muscarinic acetylcholine receptor antagonists: SAR and optimization of tyrosine ureas. Bioorg Med Chem Lett18:5481-6 (2008) 
 
Muscarinic acetylcholine receptor M3
Name:Muscarinic acetylcholine receptor M3
Type:Enzyme
Mol. Mass.:66151.03
Organism:Homo sapiens (Human)
Description:P20309
Residue:590
BDBM50413109
NameBDBM50413109
Synonyms:CHEMBL553448
TypeSmall organic molecule
Emp. Form.C34H43N4O6S
Mol. Mass.635.793
SMILESC[N+]1(Cc2ccc(O)cc2)CCC[C@@H](C1)NC(=O)[C@H](Cc1ccc(O)cc1)NC(=O)Nc1ccc(s1)C(=O)OC1CCCCC1