Reaction Details
TargetMuscarinic acetylcholine receptor M3
LigandBDBM50413142
Substrate/Competitorn/a
Meas. Tech.ChEMBL_496878 (CHEMBL998547)
IC50 6.31±n/a nM
Citation Jin, JWang, YShi, DWang, FFu, WDavis, RSJin, QFoley, JJSarau, HMMorrow, DMMoore, MLRivero, RAPalovich, MSalmon, MBelmonte, KEBusch-Petersen, J Muscarinic acetylcholine receptor antagonists: SAR and optimization of tyrosine ureas. Bioorg Med Chem Lett18:5481-6 (2008) 
 
Muscarinic acetylcholine receptor M3
Name:Muscarinic acetylcholine receptor M3
Type:Enzyme
Mol. Mass.:66151.03
Organism:Homo sapiens (Human)
Description:P20309
Residue:590
BDBM50413142
NameBDBM50413142
Synonyms:CHEMBL540399
TypeSmall organic molecule
Emp. Form.C32H37N4O7
Mol. Mass.589.6582
SMILESCCOC(=O)c1ccc(NC(=O)N[C@@H](Cc2ccc(O)cc2)C(=O)N[C@H]2CC[N+](C)(Cc3ccc4OCOc4c3)C2)cc1