Reaction Details
TargetMuscarinic acetylcholine receptor M3
LigandBDBM50413126
Substrate/Competitorn/a
Meas. Tech.ChEMBL_496878 (CHEMBL998547)
IC50 10±n/a nM
Citation Jin, JWang, YShi, DWang, FFu, WDavis, RSJin, QFoley, JJSarau, HMMorrow, DMMoore, MLRivero, RAPalovich, MSalmon, MBelmonte, KEBusch-Petersen, J Muscarinic acetylcholine receptor antagonists: SAR and optimization of tyrosine ureas. Bioorg Med Chem Lett18:5481-6 (2008) 
 
Muscarinic acetylcholine receptor M3
Name:Muscarinic acetylcholine receptor M3
Type:Enzyme
Mol. Mass.:66151.03
Organism:Homo sapiens (Human)
Description:P20309
Residue:590
BDBM50413126
NameBDBM50413126
Synonyms:CHEMBL486982
TypeSmall organic molecule
Emp. Form.C31H36N4O6
Mol. Mass.560.6407
SMILESCCCOC(=O)c1ccc(NC(=O)N[C@@H](Cc2ccc(O)cc2)C(=O)NC2CCN(Cc3ccc(O)cc3)C2)cc1