Reaction Details
TargetSalicyl-AMP ligase / salicyl-S-ArCP synthetase
LigandBDBM50413192
Substrate/Competitorn/a
Meas. Tech.ChEMBL_493446 (CHEMBL942239)
Ki 3.2±n/a nM
Citation Labello, NPBennett, EMFerguson, DMAldrich, CC Quantitative three dimensional structure linear interaction energy model of 5'-O-[N-(salicyl)sulfamoyl]adenosine and the aryl acid adenylating enzyme MbtA. J Med Chem51:7154-60 (2009) 
 
Salicyl-AMP ligase / salicyl-S-ArCP synthetase
Name:Salicyl-AMP ligase / salicyl-S-ArCP synthetase
Type:PROTEIN
Mol. Mass.:59275.32
Organism:Mycobacterium tuberculosis
Description:ChEMBL_423930
Residue:565
BDBM50413192
NameBDBM50413192
Synonyms:CHEMBL611786
TypeSmall organic molecule
Emp. Form.C17H18N6O7S
Mol. Mass.450.426
SMILESNc1ncnc2n(cnc12)C1OC(COS(=O)(=O)NC(=O)c2ccccc2O)CC1O