Reaction Details
TargetC5a anaphylatoxin chemotactic receptor 1
LigandBDBM50413246
Substrate/Competitorn/a
Meas. Tech.ChEMBL_541063 (CHEMBL1024763)
IC50 3162.28±n/a nM
Citation Sanganee, HJBaxter, ABarber, SBrown, AJGrice, DHunt, FKing, SLaughton, DPairaudeau, GThong, BWeaver, RUnitt, J Discovery of small molecule human C5a receptor antagonists. Bioorg Med Chem Lett19:1143-7 (2009) 
 
C5a anaphylatoxin chemotactic receptor 1
Name:C5a anaphylatoxin chemotactic receptor 1
Type:Enzyme
Mol. Mass.:39347.68
Organism:Homo sapiens (Human)
Description:P21730
Residue:350
BDBM50413246
NameBDBM50413246
Synonyms:CHEMBL512543
TypeSmall organic molecule
Emp. Form.C27H32FN3O6
Mol. Mass.513.5579
SMILESCOc1ccc(N(C(C(=O)NC[C@@H](C)O)c2ccccc2F)C(=O)c2occc2CN(C)C)c(OC)c1