Reaction Details
TargetcAMP-specific 3',5'-cyclic phosphodiesterase 4B
LigandBDBM50413299
Substrate/Competitorn/a
Meas. Tech.ChEMBL_565939 (CHEMBL960834)
IC50 15.85±n/a nM
Citation Lunniss, CJCooper, AWEldred, CDKranz, MLindvall, MLucas, FSNeu, MPreston, AGRanshaw, LERedgrave, AJEd Robinson, JShipley, TJSolanke, YESomers, DOWiseman, JO Quinolines as a novel structural class of potent and selective PDE4 inhibitors: optimisation for oral administration. Bioorg Med Chem Lett19:1380-5 (2009) 
 
cAMP-specific 3',5'-cyclic phosphodiesterase 4B
Name:cAMP-specific 3',5'-cyclic phosphodiesterase 4B
Type:Protein
Mol. Mass.:83318.87
Organism:Homo sapiens (Human)
Description:Q07343
Residue:736
BDBM50413299
NameBDBM50413299
Synonyms:CHEMBL463417
TypeSmall organic molecule
Emp. Form.C17H14ClN3O3S
Mol. Mass.375.829
SMILESCS(=O)(=O)c1ccc2ncc(C(N)=O)c(Nc3cccc(Cl)c3)c2c1