Reaction Details
TargetMas-related G-protein coupled receptor member X1
LigandBDBM50413338
Substrate/Competitorn/a
Meas. Tech.ChEMBL_562318 (CHEMBL1015292)
EC50 630.96±n/a nM
Citation Malik, LKelly, NMMa, JNCurrier, EABurstein, ESOlsson, R Discovery of non-peptidergic MrgX1 and MrgX2 receptor agonists and exploration of an initial SAR using solid-phase synthesis. Bioorg Med Chem Lett19:1729-32 (2009) 
 
Mas-related G-protein coupled receptor member X1
Name:Mas-related G-protein coupled receptor member X1
Type:PROTEIN
Mol. Mass.:36253.68
Organism:Homo sapiens (Human)
Description:ChEMBL_516621
Residue:322
BDBM50413338
NameBDBM50413338
Synonyms:CHEMBL501027
TypeSmall organic molecule
Emp. Form.C34H40FN7O2
Mol. Mass.597.7255
SMILESCC(C)C1C(=O)Nc2ccc(NCCCN(C)C)cc2-c2nc3cc(ccc3n12)C(=O)N1CCN(CC1)c1ccc(F)cc1