Reaction Details
TargetMuscarinic acetylcholine receptor M3
LigandBDBM50413432
Substrate/Competitorn/a
Meas. Tech.ChEMBL_562387 (CHEMBL1018820)
IC50 316.23±n/a nM
Citation Budzik, BWang, YShi, DWang, FXie, HWan, ZZhu, CFoley, JJNuthulaganti, PKallal, LASarau, HMMorrow, DMMoore, MLRivero, RAPalovich, MSalmon, MBelmonte, KELaine, DIJin, J M3 muscarinic acetylcholine receptor antagonists: SAR and optimization of bi-aryl amines. Bioorg Med Chem Lett19:1686-90 (2009) 
 
Muscarinic acetylcholine receptor M3
Name:Muscarinic acetylcholine receptor M3
Type:Enzyme
Mol. Mass.:66151.03
Organism:Homo sapiens (Human)
Description:P20309
Residue:590
BDBM50413432
NameBDBM50413432
Synonyms:CHEMBL495025
TypeSmall organic molecule
Emp. Form.C26H26N4O
Mol. Mass.410.5108
SMILESO=C(NCc1cccc(c1)-c1cccc(CN2CCNCC2)c1)c1ccccc1C#N