Reaction Details
TargetMuscarinic acetylcholine receptor M3
LigandBDBM50413444
Substrate/Competitorn/a
Meas. Tech.ChEMBL_562387 (CHEMBL1018820)
IC50 19.95±n/a nM
Citation Budzik, BWang, YShi, DWang, FXie, HWan, ZZhu, CFoley, JJNuthulaganti, PKallal, LASarau, HMMorrow, DMMoore, MLRivero, RAPalovich, MSalmon, MBelmonte, KELaine, DIJin, J M3 muscarinic acetylcholine receptor antagonists: SAR and optimization of bi-aryl amines. Bioorg Med Chem Lett19:1686-90 (2009) 
 
Muscarinic acetylcholine receptor M3
Name:Muscarinic acetylcholine receptor M3
Type:Enzyme
Mol. Mass.:66151.03
Organism:Homo sapiens (Human)
Description:P20309
Residue:590
BDBM50413444
NameBDBM50413444
Synonyms:CHEMBL492374
TypeSmall organic molecule
Emp. Form.C27H29N3O3
Mol. Mass.443.5375
SMILESCOC(=O)c1cccc(c1)C(=O)NCc1cccc(c1)-c1cccc(CN2CCNCC2)c1