Reaction Details
TargetMuscarinic acetylcholine receptor M3
LigandBDBM50413458
Substrate/Competitorn/a
Meas. Tech.ChEMBL_562388 (CHEMBL1018821)
Kd 0.0631±n/a nM
Citation Budzik, BWang, YShi, DWang, FXie, HWan, ZZhu, CFoley, JJNuthulaganti, PKallal, LASarau, HMMorrow, DMMoore, MLRivero, RAPalovich, MSalmon, MBelmonte, KELaine, DIJin, J M3 muscarinic acetylcholine receptor antagonists: SAR and optimization of bi-aryl amines. Bioorg Med Chem Lett19:1686-90 (2009) 
 
Muscarinic acetylcholine receptor M3
Name:Muscarinic acetylcholine receptor M3
Type:Enzyme
Mol. Mass.:66151.03
Organism:Homo sapiens (Human)
Description:P20309
Residue:590
BDBM50413458
NameBDBM50413458
Synonyms:CHEMBL508097
TypeSmall organic molecule
Emp. Form.C34H44FN5O2
Mol. Mass.573.7439
SMILESCC1CN(Cc2cccc(c2)-c2cc(CNC(=O)c3cccc(CN4CCN(CCCO)CC4)c3)ccc2F)CCN1