Reaction Details
TargetMuscarinic acetylcholine receptor M3
LigandBDBM50412733
Substrate/Competitorn/a
Meas. Tech.ChEMBL_562388 (CHEMBL1018821)
Kd 0.158±n/a nM
Citation Budzik, BWang, YShi, DWang, FXie, HWan, ZZhu, CFoley, JJNuthulaganti, PKallal, LASarau, HMMorrow, DMMoore, MLRivero, RAPalovich, MSalmon, MBelmonte, KELaine, DIJin, J M3 muscarinic acetylcholine receptor antagonists: SAR and optimization of bi-aryl amines. Bioorg Med Chem Lett19:1686-90 (2009) 
 
Muscarinic acetylcholine receptor M3
Name:Muscarinic acetylcholine receptor M3
Type:Enzyme
Mol. Mass.:66151.03
Organism:Homo sapiens (Human)
Description:P20309
Residue:590
BDBM50412733
NameBDBM50412733
Synonyms:CHEMBL538864 | CHEMBL555476
TypeSmall organic molecule
Emp. Form.C33H43FN5O
Mol. Mass.544.7253
SMILESC[C@H]1CN(Cc2cccc(c2)-c2cc(CNC(=O)c3cccc(CN4CC[N+](C)(C)CC4)c3)ccc2F)CCN1