Reaction Details
TargetMuscarinic acetylcholine receptor M3
LigandBDBM50413467
Substrate/Competitorn/a
Meas. Tech.ChEMBL_562388 (CHEMBL1018821)
Kd 0.1±n/a nM
Citation Budzik, BWang, YShi, DWang, FXie, HWan, ZZhu, CFoley, JJNuthulaganti, PKallal, LASarau, HMMorrow, DMMoore, MLRivero, RAPalovich, MSalmon, MBelmonte, KELaine, DIJin, J M3 muscarinic acetylcholine receptor antagonists: SAR and optimization of bi-aryl amines. Bioorg Med Chem Lett19:1686-90 (2009) 
 
Muscarinic acetylcholine receptor M3
Name:Muscarinic acetylcholine receptor M3
Type:Enzyme
Mol. Mass.:66151.03
Organism:Homo sapiens (Human)
Description:P20309
Residue:590
BDBM50413467
NameBDBM50413467
Synonyms:CHEMBL540251
TypeSmall organic molecule
Emp. Form.C35H47FN5O
Mol. Mass.572.7784
SMILESCCC[N+]1(C)CCN(Cc2cccc(c2)C(=O)NCc2ccc(F)c(c2)-c2cccc(CN3CCN[C@@H](C)C3)c2)CC1