Reaction Details
TargetMuscarinic acetylcholine receptor M3
LigandBDBM50413471
Substrate/Competitorn/a
Meas. Tech.ChEMBL_562387 (CHEMBL1018820)
IC50 251.19±n/a nM
Citation Budzik, BWang, YShi, DWang, FXie, HWan, ZZhu, CFoley, JJNuthulaganti, PKallal, LASarau, HMMorrow, DMMoore, MLRivero, RAPalovich, MSalmon, MBelmonte, KELaine, DIJin, J M3 muscarinic acetylcholine receptor antagonists: SAR and optimization of bi-aryl amines. Bioorg Med Chem Lett19:1686-90 (2009) 
 
Muscarinic acetylcholine receptor M3
Name:Muscarinic acetylcholine receptor M3
Type:Enzyme
Mol. Mass.:66151.03
Organism:Homo sapiens (Human)
Description:P20309
Residue:590
BDBM50413471
NameBDBM50413471
Synonyms:CHEMBL493939
TypeSmall organic molecule
Emp. Form.C26H26FN3O3
Mol. Mass.447.5013
SMILESFc1ccc(cc1CNC(=O)c1ccc2OCOc2c1)-c1cccc(CN2CCNCC2)c1