Reaction Details
TargetMuscarinic acetylcholine receptor M3
LigandBDBM50413475
Substrate/Competitorn/a
Meas. Tech.ChEMBL_562387 (CHEMBL1018820)
IC50 316.23±n/a nM
Citation Budzik, BWang, YShi, DWang, FXie, HWan, ZZhu, CFoley, JJNuthulaganti, PKallal, LASarau, HMMorrow, DMMoore, MLRivero, RAPalovich, MSalmon, MBelmonte, KELaine, DIJin, J M3 muscarinic acetylcholine receptor antagonists: SAR and optimization of bi-aryl amines. Bioorg Med Chem Lett19:1686-90 (2009) 
 
Muscarinic acetylcholine receptor M3
Name:Muscarinic acetylcholine receptor M3
Type:Enzyme
Mol. Mass.:66151.03
Organism:Homo sapiens (Human)
Description:P20309
Residue:590
BDBM50413475
NameBDBM50413475
Synonyms:CHEMBL494836
TypeSmall organic molecule
Emp. Form.C27H29N3O3
Mol. Mass.443.5375
SMILESO=C(NCc1cccc(c1)-c1cccc(CN2CCCNCC2)c1)c1ccc2OCOc2c1