Reaction Details
TargetCholecystokinin receptor type A
LigandBDBM50413478
Substrate/Competitorn/a
Meas. Tech.ChEMBL_567123 (CHEMBL1030802)
Ki 3.72±n/a nM
Citation Akgün, EKörner, MGao, FHarikumar, KGWaser, BReubi, JCPortoghese, PSMiller, LJ Synthesis and in vitro characterization of radioiodinatable benzodiazepines selective for type 1 and type 2 cholecystokinin receptors. J Med Chem52:2138-47 (2009) 
 
Cholecystokinin receptor type A
Name:Cholecystokinin receptor type A
Type:G Protein-Coupled Receptor (GPCR)
Mol. Mass.:47859.34
Organism:Homo sapiens (Human)
Description:Stable expression of human CCK-1 receptors in HEK 293 cells.
Residue:428
BDBM50413478
NameBDBM50413478
Synonyms:CHEMBL515288
TypeSmall organic molecule
Emp. Form.C23H19IN4O2
Mol. Mass.510.327
SMILESCN1c2ccccc2C(=N[C@@H](NC(=O)Nc2cccc(I)c2)C1=O)c1ccccc1