Reaction Details
TargetNeuronal acetylcholine receptor subunit alpha-4
LigandBDBM50187447
Substrate/Competitorn/a
Meas. Tech.ChEMBL_562742 (CHEMBL1022414)
IC50 0.891±n/a nM
Citation Tosco, PAhring, PKDyhring, TPeters, DHarpsøe, KLiljefors, TBalle, T Complementary three-dimensional quantitative structure-activity relationship modeling of binding affinity and functional potency: a study on alpha4beta2 nicotinic ligands. J Med Chem52:2311-6 (2009) 
 
Neuronal acetylcholine receptor subunit alpha-4
Name:Neuronal acetylcholine receptor subunit alpha-4
Type:n/a
Mol. Mass.:69963.49
Organism:Homo sapiens (Human)
Description:NACHRA4
Residue:627
BDBM50187447
NameBDBM50187447
Synonyms:1-(pyridin-3-yl)-1,5-diazocane CHEMBL210776
TypeSmall organic molecule
Emp. Form.C11H17N3
Mol. Mass.191.2728
SMILESC1CNCCCN(C1)c1cccnc1