Reaction Details
TargetNeuronal acetylcholine receptor subunit alpha-4
LigandBDBM50187437
Substrate/Competitorn/a
Meas. Tech.ChEMBL_562742 (CHEMBL1022414)
IC50 2±n/a nM
Citation Tosco, PAhring, PKDyhring, TPeters, DHarpsøe, KLiljefors, TBalle, T Complementary three-dimensional quantitative structure-activity relationship modeling of binding affinity and functional potency: a study on alpha4beta2 nicotinic ligands. J Med Chem52:2311-6 (2009) 
 
Neuronal acetylcholine receptor subunit alpha-4
Name:Neuronal acetylcholine receptor subunit alpha-4
Type:n/a
Mol. Mass.:69963.49
Organism:Homo sapiens (Human)
Description:NACHRA4
Residue:627
BDBM50187437
NameBDBM50187437
Synonyms:1-(5-chloropyridin-3-yl)-1,5-diazocane CHEMBL210548
TypeSmall organic molecule
Emp. Form.C11H16ClN3
Mol. Mass.225.718
SMILESClc1cncc(c1)N1CCCNCCC1