Reaction Details
TargetNeuronal acetylcholine receptor subunit alpha-4
LigandBDBM50088453
Substrate/Competitorn/a
Meas. Tech.ChEMBL_562743 (CHEMBL1022415)
EC50 257.04±n/a nM
Citation Tosco, PAhring, PKDyhring, TPeters, DHarpsøe, KLiljefors, TBalle, T Complementary three-dimensional quantitative structure-activity relationship modeling of binding affinity and functional potency: a study on alpha4beta2 nicotinic ligands. J Med Chem52:2311-6 (2009) 
 
Neuronal acetylcholine receptor subunit alpha-4
Name:Neuronal acetylcholine receptor subunit alpha-4
Type:n/a
Mol. Mass.:69963.49
Organism:Homo sapiens (Human)
Description:NACHRA4
Residue:627
BDBM50088453
NameBDBM50088453
Synonyms:1-(6-Bromo-5-ethoxy-pyridin-3-yl)-[1,4]diazepane CHEMBL72433 | NS3570, 5
TypeSmall organic molecule
Emp. Form.C12H18BrN3O
Mol. Mass.300.195
SMILESCCOc1cc(cnc1Br)N1CCCNCC1