Reaction Details
TargetBeta-1 adrenergic receptor
LigandBDBM50413484
Substrate/Competitorn/a
Meas. Tech.ChEMBL_562924 (CHEMBL1019684)
EC50 2±n/a nM
Citation Procopiou, PABarrett, VJBevan, NJBiggadike, KButchers, PRCoe, DMConroy, REdney, DDField, RNFord, AJGuntrip, SBLooker, BEMcLay, IMMonteith, MJMorrison, VSMutch, PJRichards, SASasse, RSmith, CE Synthesis and structure-activity relationships of long-acting beta2 adrenergic receptor agonists incorporating arylsulfonamide groups. J Med Chem52:2280-8 (2009) 
 
Beta-1 adrenergic receptor
Name:Beta-1 adrenergic receptor
Type:Enzyme Catalytic Domain
Mol. Mass.:50540.48
Organism:GUINEA PIG
Description:adrenergic Beta1 ADRB1 GUINEA PIG::B0FL73
Residue:467
BDBM50413484
NameBDBM50413484
Synonyms:CHEMBL475389
TypeSmall organic molecule
Emp. Form.C25H38N2O6S
Mol. Mass.494.644
SMILESNS(=O)(=O)c1ccc(CCCCOCCCCCCNC[C@H](O)c2ccc(O)c(CO)c2)cc1