Reaction Details
TargetBeta-1 adrenergic receptor
LigandBDBM50413492
Substrate/Competitorn/a
Meas. Tech.ChEMBL_562920 (CHEMBL1018857)
EC50 5012±n/a nM
Citation Procopiou, PABarrett, VJBevan, NJBiggadike, KButchers, PRCoe, DMConroy, REdney, DDField, RNFord, AJGuntrip, SBLooker, BEMcLay, IMMonteith, MJMorrison, VSMutch, PJRichards, SASasse, RSmith, CE Synthesis and structure-activity relationships of long-acting beta2 adrenergic receptor agonists incorporating arylsulfonamide groups. J Med Chem52:2280-8 (2009) 
 
Beta-1 adrenergic receptor
Name:Beta-1 adrenergic receptor
Type:G Protein-Coupled Receptor (GPCR)
Mol. Mass.:51338.40
Organism:Homo sapiens (Human)
Description:P08588
Residue:477
BDBM50413492
NameBDBM50413492
Synonyms:CHEMBL475236
TypeSmall organic molecule
Emp. Form.C25H38N2O6S
Mol. Mass.494.644
SMILESNS(=O)(=O)c1cccc(CCCCOCCCCCCNC[C@@H](O)c2ccc(O)c(CO)c2)c1