Reaction Details
TargetBeta-2 adrenergic receptor
LigandBDBM50413485
Substrate/Competitorn/a
Meas. Tech.ChEMBL_562921 (CHEMBL1019681)
EC50 0.158489±n/a nM
Citation Procopiou, PABarrett, VJBevan, NJBiggadike, KButchers, PRCoe, DMConroy, REdney, DDField, RNFord, AJGuntrip, SBLooker, BEMcLay, IMMonteith, MJMorrison, VSMutch, PJRichards, SASasse, RSmith, CE Synthesis and structure-activity relationships of long-acting beta2 adrenergic receptor agonists incorporating arylsulfonamide groups. J Med Chem52:2280-8 (2009) 
 
Beta-2 adrenergic receptor
Name:Beta-2 adrenergic receptor
Type:n/a
Mol. Mass.:46461.69
Organism:Homo sapiens (Human)
Description:P07550
Residue:413
BDBM50413485
NameBDBM50413485
Synonyms:CHEMBL446840 | CHEMBL483200
TypeSmall organic molecule
Emp. Form.C25H38N2O6S
Mol. Mass.494.644
SMILESNS(=O)(=O)c1cccc(CCCCOCCCCCCNC[C@H](O)c2ccc(O)c(CO)c2)c1