Reaction Details
TargetHistamine H3 receptor
LigandBDBM50413500
Substrate/Competitorn/a
Meas. Tech.ChEMBL_562954 (CHEMBL1015353)
EC50 1.4±n/a nM
Citation Igel, PSchneider, ESchnell, DElz, SSeifert, RBuschauer, A N(G)-acylated imidazolylpropylguanidines as potent histamine H4 receptor agonists: selectivity by variation of the N(G)-substituent. J Med Chem52:2623-7 (2009) 
 
Histamine H3 receptor
Name:Histamine H3 receptor
Type:G Protein-Coupled Receptor (GPCR)
Mol. Mass.:48691.47
Organism:Homo sapiens (Human)
Description:Binding assays were using CHO cells stably expressing hH3R receptors.
Residue:445
BDBM50413500
NameBDBM50413500
Synonyms:CHEMBL471724 | UR-PI287
TypeSmall organic molecule
Emp. Form.C11H19N5O
Mol. Mass.237.3015
SMILESCC(C)C(=O)NC(N)=NCCCc1cnc[nH]1