Reaction Details
TargetHistamine H2 receptor
LigandBDBM50413500
Substrate/Competitorn/a
Meas. Tech.ChEMBL_562964 (CHEMBL1015363)
EC50 110±n/a nM
Citation Igel, PSchneider, ESchnell, DElz, SSeifert, RBuschauer, A N(G)-acylated imidazolylpropylguanidines as potent histamine H4 receptor agonists: selectivity by variation of the N(G)-substituent. J Med Chem52:2623-7 (2009) 
 
Histamine H2 receptor
Name:Histamine H2 receptor
Type:G Protein-Coupled Receptor (GPCR)
Mol. Mass.:40567.22
Organism:Cavia porcellus (domestic guinea pig)
Description:For the H2 receptor-binding assays, guinea pig striatum was used.
Residue:359
BDBM50413500
NameBDBM50413500
Synonyms:CHEMBL471724 | UR-PI287
TypeSmall organic molecule
Emp. Form.C11H19N5O
Mol. Mass.237.3015
SMILESCC(C)C(=O)NC(N)=NCCCc1cnc[nH]1