Reaction Details
TargetHistamine H4 receptor
LigandBDBM50377986
Substrate/Competitorn/a
Meas. Tech.ChEMBL_562955 (CHEMBL1015354)
EC50 15±n/a nM
Citation Igel, PSchneider, ESchnell, DElz, SSeifert, RBuschauer, A N(G)-acylated imidazolylpropylguanidines as potent histamine H4 receptor agonists: selectivity by variation of the N(G)-substituent. J Med Chem52:2623-7 (2009) 
 
Histamine H4 receptor
Name:Histamine H4 receptor
Type:G Protein-Coupled Receptor (GPCR)
Mol. Mass.:44517.02
Organism:Homo sapiens (Human)
Description:Binding assays were using CHO cells stably expressing hH4R receptors.
Residue:390
BDBM50377986
NameBDBM50377986
Synonyms:CHEMBL483406 | UR-AK24
TypeSmall organic molecule
Emp. Form.C17H23N5O
Mol. Mass.313.3974
SMILESCC(CC(=O)NC(N)=NCCCc1cnc[nH]1)c1ccccc1