Reaction Details
TargetHistamine H1 receptor
LigandBDBM50413499
Substrate/Competitorn/a
Meas. Tech.ChEMBL_562952 (CHEMBL1015351)
EC50 2188±n/a nM
Citation Igel, PSchneider, ESchnell, DElz, SSeifert, RBuschauer, A N(G)-acylated imidazolylpropylguanidines as potent histamine H4 receptor agonists: selectivity by variation of the N(G)-substituent. J Med Chem52:2623-7 (2009) 
 
Histamine H1 receptor
Name:Histamine H1 receptor
Type:G Protein-Coupled Receptor (GPCR)
Mol. Mass.:55808.72
Organism:Homo sapiens (Human)
Description:Cell pellets from SK-N-MC cells transfected with human H1 receptor were used in binding assay.
Residue:487
BDBM50413499
NameBDBM50413499
Synonyms:CHEMBL465170 | UR-PI295
TypeSmall organic molecule
Emp. Form.C11H19N5O
Mol. Mass.237.3015
SMILESCCCC(=O)NC(N)=NCCCc1cnc[nH]1