Reaction Details
TargetHistamine H2 receptor
LigandBDBM50413499
Substrate/Competitorn/a
Meas. Tech.ChEMBL_562953 (CHEMBL1015352)
EC50 141±n/a nM
Citation Igel, PSchneider, ESchnell, DElz, SSeifert, RBuschauer, A N(G)-acylated imidazolylpropylguanidines as potent histamine H4 receptor agonists: selectivity by variation of the N(G)-substituent. J Med Chem52:2623-7 (2009) 
 
Histamine H2 receptor
Name:Histamine H2 receptor
Type:G Protein-Coupled Receptor (GPCR)
Mol. Mass.:40115.31
Organism:Homo sapiens (Human)
Description:n/a
Residue:359
BDBM50413499
NameBDBM50413499
Synonyms:CHEMBL465170 | UR-PI295
TypeSmall organic molecule
Emp. Form.C11H19N5O
Mol. Mass.237.3015
SMILESCCCC(=O)NC(N)=NCCCc1cnc[nH]1