Reaction Details
TargetHistamine H2 receptor
LigandBDBM50413497
Substrate/Competitorn/a
Meas. Tech.ChEMBL_562953 (CHEMBL1015352)
EC50 724±n/a nM
Citation Igel, PSchneider, ESchnell, DElz, SSeifert, RBuschauer, A N(G)-acylated imidazolylpropylguanidines as potent histamine H4 receptor agonists: selectivity by variation of the N(G)-substituent. J Med Chem52:2623-7 (2009) 
 
Histamine H2 receptor
Name:Histamine H2 receptor
Type:G Protein-Coupled Receptor (GPCR)
Mol. Mass.:40115.31
Organism:Homo sapiens (Human)
Description:n/a
Residue:359
BDBM50413497
NameBDBM50413497
Synonyms:CHEMBL443896 | UR-PI288
TypeSmall organic molecule
Emp. Form.C9H15N5O
Mol. Mass.209.2483
SMILESCC(=O)NC(N)=NCCCc1cnc[nH]1