Reaction Details
Target5-hydroxytryptamine receptor 1A
LigandBDBM50413553
Substrate/Competitorn/a
Meas. Tech.ChEMBL_501239 (CHEMBL975274)
Ki 0.126±n/a nM
Citation Bromidge, SMBertani, BBorriello, MBozzoli, AFaedo, SGianotti, MGordon, LJHill, MZucchelli, VWatson, JMZonzini, L 8-[2-(4-Aryl-1-piperazinyl)ethyl]-2H-1,4-benzoxazin-3(4H)-ones: dual-acting 5-HT1 receptor antagonists and serotonin reuptake inhibitors--part II. Bioorg Med Chem Lett19:2338-42 (2009) 
 
5-hydroxytryptamine receptor 1A
Name:5-hydroxytryptamine receptor 1A
Type:n/a
Mol. Mass.:46122.49
Organism:Homo sapiens (Human)
Description:n/a
Residue:422
BDBM50413553
NameBDBM50413553
Synonyms:CHEMBL472290
TypeSmall organic molecule
Emp. Form.C26H30N4O2
Mol. Mass.430.542
SMILESCCN1C(=O)COc2c(CCN3CCN(CC3)c3cccc4nc(C)ccc34)cccc12