Reaction Details
Target5-hydroxytryptamine receptor 1B
LigandBDBM50413561
Substrate/Competitorn/a
Meas. Tech.ChEMBL_501241 (CHEMBL975276)
Ki 2±n/a nM
Citation Bromidge, SMBertani, BBorriello, MBozzoli, AFaedo, SGianotti, MGordon, LJHill, MZucchelli, VWatson, JMZonzini, L 8-[2-(4-Aryl-1-piperazinyl)ethyl]-2H-1,4-benzoxazin-3(4H)-ones: dual-acting 5-HT1 receptor antagonists and serotonin reuptake inhibitors--part II. Bioorg Med Chem Lett19:2338-42 (2009) 
 
5-hydroxytryptamine receptor 1B
Name:5-hydroxytryptamine receptor 1B
Type:G Protein-Coupled Receptor (GPCR)
Mol. Mass.:43579.17
Organism:Homo sapiens (Human)
Description:Receptor binding assays were performed using human clone stably expressed in CHO cells
Residue:390
BDBM50413561
NameBDBM50413561
Synonyms:CHEMBL513875
TypeSmall organic molecule
Emp. Form.C26H29FN4O2
Mol. Mass.448.5325
SMILESC[C@@H]1CN(CCN1CCc1cccc2N(C)C(=O)COc12)c1cc(F)cc2nc(C)ccc12