Reaction Details
TargetC-X-C chemokine receptor type 3
LigandBDBM50337250
Substrate/Competitorn/a
Meas. Tech.ChEMBL_497564 (CHEMBL998621)
Ki 3.16±n/a nM
Citation Wijtmans, MVerzijl, Dvan Dam, CMBosch, LSmit, MJLeurs, Rde Esch, IJ Exploring a pocket for polycycloaliphatic groups in the CXCR3 receptor with the aid of a modular synthetic strategy. Bioorg Med Chem Lett19:2252-7 (2009) 
 
C-X-C chemokine receptor type 3
Name:C-X-C chemokine receptor type 3
Type:Enzyme Catalytic Domain
Mol. Mass.:40665.65
Organism:Homo sapiens (Human)
Description:n/a
Residue:368
BDBM50337250
NameBDBM50337250
Synonyms:(S)-5-chloro-6-(4-(1-(4-chlorobenzyl)piperidin-4-yl)-3-ethylpiperazin-1-yl)-N-ethylnicotinamide | CHEMBL472288
TypeSmall organic molecule
Emp. Form.C26H35Cl2N5O
Mol. Mass.504.495
SMILESCCNC(=O)c1cnc(N2CCN([C@@H](CC)C2)C2CCN(Cc3ccc(Cl)cc3)CC2)c(Cl)c1