Reaction Details
TargetRibosyldihydronicotinamide dehydrogenase [quinone]
LigandBDBM50260410
Substrate/Competitorn/a
Meas. Tech.ChEMBL_544427 (CHEMBL1016924)
IC50 10.96±n/a nM
Citation Du, HWang, JZhang, XHu, Z A novel quantitative structure-activity relationship method to predict the affinities of MT3 melatonin binding site. Eur J Med Chem43:2861-9 (2008) 
 
Ribosyldihydronicotinamide dehydrogenase [quinone]
Name:Ribosyldihydronicotinamide dehydrogenase [quinone]
Type:Protein
Mol. Mass.:25917.25
Organism:Homo sapiens (Human)
Description:P16083
Residue:231
BDBM50260410
NameBDBM50260410
Synonyms:CHEMBL493424 methyl 3-(2-but-3-enamidoethyl)benzofuran-5-ylcarbamate
TypeSmall organic molecule
Emp. Form.C16H18N2O4
Mol. Mass.302.3251
SMILESCOC(=O)Nc1ccc2occ(CCNC(=O)CC=C)c2c1