Reaction Details
TargetRibosyldihydronicotinamide dehydrogenase [quinone]
LigandBDBM9019
Substrate/Competitorn/a
Meas. Tech.ChEMBL_544427 (CHEMBL1016924)
IC50 64.57±n/a nM
Citation Du, HWang, JZhang, XHu, Z A novel quantitative structure-activity relationship method to predict the affinities of MT3 melatonin binding site. Eur J Med Chem43:2861-9 (2008) 
 
Ribosyldihydronicotinamide dehydrogenase [quinone]
Name:Ribosyldihydronicotinamide dehydrogenase [quinone]
Type:Protein
Mol. Mass.:25917.25
Organism:Homo sapiens (Human)
Description:P16083
Residue:231
BDBM9019
NameBDBM9019
Synonyms:CHEMBL45 N-[2-(5-methoxy-1H-indol-3-yl)ethyl]acetamide
TypeSmall organic molecule
Emp. Form.C13H16N2O2
Mol. Mass.232.2783
SMILESCOc1ccc2[nH]cc(CCNC(C)=O)c2c1