Reaction Details
TargetRibosyldihydronicotinamide dehydrogenase [quinone]
LigandBDBM50112200
Substrate/Competitorn/a
Meas. Tech.ChEMBL_544427 (CHEMBL1016924)
IC50 0.0891±n/a nM
Citation Du, HWang, JZhang, XHu, Z A novel quantitative structure-activity relationship method to predict the affinities of MT3 melatonin binding site. Eur J Med Chem43:2861-9 (2008) 
 
Ribosyldihydronicotinamide dehydrogenase [quinone]
Name:Ribosyldihydronicotinamide dehydrogenase [quinone]
Type:Protein
Mol. Mass.:25917.25
Organism:Homo sapiens (Human)
Description:P16083
Residue:231
BDBM50112200
NameBDBM50112200
Synonyms:CHEMBL300056 N-[2-(2-Iodo-5-methoxy-1-methyl-1H-indol-3-yl)-ethyl]-acetamide
TypeSmall organic molecule
Emp. Form.C14H17IN2O2
Mol. Mass.372.2015
SMILESCOc1ccc2n(C)c(I)c(CCNC(C)=O)c2c1