Reaction Details
TargetRibosyldihydronicotinamide dehydrogenase [quinone]
LigandBDBM50342770
Substrate/Competitorn/a
Meas. Tech.ChEMBL_544427 (CHEMBL1016924)
IC50 18.2±n/a nM
Citation Du, HWang, JZhang, XHu, Z A novel quantitative structure-activity relationship method to predict the affinities of MT3 melatonin binding site. Eur J Med Chem43:2861-9 (2008) 
 
Ribosyldihydronicotinamide dehydrogenase [quinone]
Name:Ribosyldihydronicotinamide dehydrogenase [quinone]
Type:Protein
Mol. Mass.:25917.25
Organism:Homo sapiens (Human)
Description:P16083
Residue:231
BDBM50342770
NameBDBM50342770
Synonyms:CHEMBL456727 N-[2-(7-methylsulfanyl-naphth-1-yl)ethyl]acetamide
TypeSmall organic molecule
Emp. Form.C15H17NOS
Mol. Mass.259.367
SMILESCSc1ccc2cccc(CCNC(C)=O)c2c1