Reaction Details
Target5-hydroxytryptamine receptor 1A
LigandBDBM50413691
Substrate/Competitorn/a
Meas. Tech.ChEMBL_540308 (CHEMBL1035839)
Ki 1±n/a nM
Citation Ward, SEEddershaw, PFlynn, STGordon, LLovell, PJMoore, SHScott, CMSmith, PWThewlis, KMWyman, PA Studies on a series of potent, orally bioavailable, 5-HT(1) receptor ligands--part II. Bioorg Med Chem Lett19:428-32 (2008) 
 
5-hydroxytryptamine receptor 1A
Name:5-hydroxytryptamine receptor 1A
Type:n/a
Mol. Mass.:46122.49
Organism:Homo sapiens (Human)
Description:n/a
Residue:422
BDBM50413691
NameBDBM50413691
Synonyms:CHEMBL458199
TypeSmall organic molecule
Emp. Form.C29H38N4O
Mol. Mass.458.6382
SMILESCN1CCN(CC1)c1cccc(CC2CCN(CCOc3cccc4nc(C)ccc34)CC2)c1