Reaction Details
Target5-hydroxytryptamine receptor 1A
LigandBDBM50413698
Substrate/Competitorn/a
Meas. Tech.ChEMBL_540308 (CHEMBL1035839)
Ki 3.16±n/a nM
Citation Ward, SEEddershaw, PFlynn, STGordon, LLovell, PJMoore, SHScott, CMSmith, PWThewlis, KMWyman, PA Studies on a series of potent, orally bioavailable, 5-HT(1) receptor ligands--part II. Bioorg Med Chem Lett19:428-32 (2008) 
 
5-hydroxytryptamine receptor 1A
Name:5-hydroxytryptamine receptor 1A
Type:n/a
Mol. Mass.:46122.49
Organism:Homo sapiens (Human)
Description:n/a
Residue:422
BDBM50413698
NameBDBM50413698
Synonyms:CHEMBL459282
TypeSmall organic molecule
Emp. Form.C30H39N3O
Mol. Mass.457.6502
SMILESCN1CCC(CC1)c1cccc(CC2CCN(CCOc3cccc4nc(C)ccc34)CC2)c1