Reaction Details
Target5-hydroxytryptamine receptor 1A
LigandBDBM50413705
Substrate/Competitorn/a
Meas. Tech.ChEMBL_540308 (CHEMBL1035839)
Ki 31.62±n/a nM
Citation Ward, SEEddershaw, PFlynn, STGordon, LLovell, PJMoore, SHScott, CMSmith, PWThewlis, KMWyman, PA Studies on a series of potent, orally bioavailable, 5-HT(1) receptor ligands--part II. Bioorg Med Chem Lett19:428-32 (2008) 
 
5-hydroxytryptamine receptor 1A
Name:5-hydroxytryptamine receptor 1A
Type:n/a
Mol. Mass.:46122.49
Organism:Homo sapiens (Human)
Description:n/a
Residue:422
BDBM50413705
NameBDBM50413705
Synonyms:CHEMBL456460
TypeSmall organic molecule
Emp. Form.C28H30N2O2
Mol. Mass.426.55
SMILESCc1ccc2c(OCCN3CCC(Cc4cccc(c4)-c4ccoc4)CC3)cccc2n1