Reaction Details
Target5-hydroxytryptamine receptor 1D
LigandBDBM50413691
Substrate/Competitorn/a
Meas. Tech.ChEMBL_540312 (CHEMBL1035843)
Ki 0.501±n/a nM
Citation Ward, SEEddershaw, PFlynn, STGordon, LLovell, PJMoore, SHScott, CMSmith, PWThewlis, KMWyman, PA Studies on a series of potent, orally bioavailable, 5-HT(1) receptor ligands--part II. Bioorg Med Chem Lett19:428-32 (2008) 
 
5-hydroxytryptamine receptor 1D
Name:5-hydroxytryptamine receptor 1D
Type:G Protein-Coupled Receptor (GPCR)
Mol. Mass.:41920.63
Organism:Homo sapiens (Human)
Description:Receptor binding assays were performed using human clone stably expressed in CHO cells.
Residue:377
BDBM50413691
NameBDBM50413691
Synonyms:CHEMBL458199
TypeSmall organic molecule
Emp. Form.C29H38N4O
Mol. Mass.458.6382
SMILESCN1CCN(CC1)c1cccc(CC2CCN(CCOc3cccc4nc(C)ccc34)CC2)c1