Reaction Details
Target5-hydroxytryptamine receptor 1D
LigandBDBM50413700
Substrate/Competitorn/a
Meas. Tech.ChEMBL_540312 (CHEMBL1035843)
Ki 3.98±n/a nM
Citation Ward, SEEddershaw, PFlynn, STGordon, LLovell, PJMoore, SHScott, CMSmith, PWThewlis, KMWyman, PA Studies on a series of potent, orally bioavailable, 5-HT(1) receptor ligands--part II. Bioorg Med Chem Lett19:428-32 (2008) 
 
5-hydroxytryptamine receptor 1D
Name:5-hydroxytryptamine receptor 1D
Type:G Protein-Coupled Receptor (GPCR)
Mol. Mass.:41920.63
Organism:Homo sapiens (Human)
Description:Receptor binding assays were performed using human clone stably expressed in CHO cells.
Residue:377
BDBM50413700
NameBDBM50413700
Synonyms:CHEMBL459068
TypeSmall organic molecule
Emp. Form.C31H39N3O2
Mol. Mass.485.6603
SMILESCC(=O)N1CCC(CC1)c1cccc(CC2CCN(CCOc3cccc4nc(C)ccc34)CC2)c1