Reaction Details
Target5-hydroxytryptamine receptor 1D
LigandBDBM50413701
Substrate/Competitorn/a
Meas. Tech.ChEMBL_540312 (CHEMBL1035843)
Ki 3.16±n/a nM
Citation Ward, SEEddershaw, PFlynn, STGordon, LLovell, PJMoore, SHScott, CMSmith, PWThewlis, KMWyman, PA Studies on a series of potent, orally bioavailable, 5-HT(1) receptor ligands--part II. Bioorg Med Chem Lett19:428-32 (2008) 
 
5-hydroxytryptamine receptor 1D
Name:5-hydroxytryptamine receptor 1D
Type:G Protein-Coupled Receptor (GPCR)
Mol. Mass.:41920.63
Organism:Homo sapiens (Human)
Description:Receptor binding assays were performed using human clone stably expressed in CHO cells.
Residue:377
BDBM50413701
NameBDBM50413701
Synonyms:CHEMBL462915
TypeSmall organic molecule
Emp. Form.C30H39N3O3S
Mol. Mass.521.714
SMILESCc1ccc2c(OCCN3CCC(Cc4cccc(c4)C4CCN(CC4)S(C)(=O)=O)CC3)cccc2n1