Reaction Details
Target5-hydroxytryptamine receptor 1B
LigandBDBM50413695
Substrate/Competitorn/a
Meas. Tech.ChEMBL_540310 (CHEMBL1035841)
Ki 158.49±n/a nM
Citation Ward, SEEddershaw, PFlynn, STGordon, LLovell, PJMoore, SHScott, CMSmith, PWThewlis, KMWyman, PA Studies on a series of potent, orally bioavailable, 5-HT(1) receptor ligands--part II. Bioorg Med Chem Lett19:428-32 (2008) 
 
5-hydroxytryptamine receptor 1B
Name:5-hydroxytryptamine receptor 1B
Type:G Protein-Coupled Receptor (GPCR)
Mol. Mass.:43579.17
Organism:Homo sapiens (Human)
Description:Receptor binding assays were performed using human clone stably expressed in CHO cells
Residue:390
BDBM50413695
NameBDBM50413695
Synonyms:CHEMBL513955
TypeSmall organic molecule
Emp. Form.C30H39N3O2
Mol. Mass.473.6496
SMILESC[C@H]1CN(C[C@@H](C)O1)c1cccc(CC2CCN(CCOc3cccc4nc(C)ccc34)CC2)c1