Reaction Details
Target5-hydroxytryptamine receptor 1B
LigandBDBM50413703
Substrate/Competitorn/a
Meas. Tech.ChEMBL_540310 (CHEMBL1035841)
Ki 12.59±n/a nM
Citation Ward, SEEddershaw, PFlynn, STGordon, LLovell, PJMoore, SHScott, CMSmith, PWThewlis, KMWyman, PA Studies on a series of potent, orally bioavailable, 5-HT(1) receptor ligands--part II. Bioorg Med Chem Lett19:428-32 (2008) 
 
5-hydroxytryptamine receptor 1B
Name:5-hydroxytryptamine receptor 1B
Type:G Protein-Coupled Receptor (GPCR)
Mol. Mass.:43579.17
Organism:Homo sapiens (Human)
Description:Receptor binding assays were performed using human clone stably expressed in CHO cells
Residue:390
BDBM50413703
NameBDBM50413703
Synonyms:CHEMBL516997
TypeSmall organic molecule
Emp. Form.C29H31N3O
Mol. Mass.437.5759
SMILESCc1ccc2c(OCCN3CCC(Cc4cccc(c4)-c4cccnc4)CC3)cccc2n1