Reaction Details
Target5-hydroxytryptamine receptor 1A
LigandBDBM50413706
Substrate/Competitorn/a
Meas. Tech.ChEMBL_540308 (CHEMBL1035839)
Ki 5.01±n/a nM
Citation Ward, SEEddershaw, PFlynn, STGordon, LLovell, PJMoore, SHScott, CMSmith, PWThewlis, KMWyman, PA Studies on a series of potent, orally bioavailable, 5-HT(1) receptor ligands--part II. Bioorg Med Chem Lett19:428-32 (2008) 
 
5-hydroxytryptamine receptor 1A
Name:5-hydroxytryptamine receptor 1A
Type:n/a
Mol. Mass.:46122.49
Organism:Homo sapiens (Human)
Description:n/a
Residue:422
BDBM50413706
NameBDBM50413706
Synonyms:CHEMBL457765
TypeSmall organic molecule
Emp. Form.C28H35N3O2
Mol. Mass.445.5964
SMILESCc1ccc2c(OCCN3CCC(Cc4cccc(c4)N4CCOCC4)CC3)cccc2n1