Reaction Details
TargetOxytocin receptor
LigandBDBM50413717
Substrate/Competitorn/a
Meas. Tech.ChEMBL_540346 (CHEMBL1025689)
Ki 3.98±n/a nM
Citation Barton, NPBellenie, BRDoran, ATEmmons, AJHeer, JPSalvagno, CM Discovery and optimisation of a potent and selective tertiary sulfonamide oxytocin antagonist. Bioorg Med Chem Lett19:528-32 (2008) 
 
Oxytocin receptor
Name:Oxytocin receptor
Type:Enzyme Catalytic Domain
Mol. Mass.:42793.26
Organism:Homo sapiens (Human)
Description:Oxytocin OXTR HEK293::B2R9L7
Residue:389
BDBM50413717
NameBDBM50413717
Synonyms:CHEMBL515818
TypeSmall organic molecule
Emp. Form.C24H22N4O3S
Mol. Mass.446.521
SMILESCOc1ccc(cn1)N(Cc1ccc(cn1)-c1ccccc1C)S(=O)(=O)c1ccccn1