Reaction Details
TargetOxytocin receptor
LigandBDBM50413723
Substrate/Competitorn/a
Meas. Tech.ChEMBL_540346 (CHEMBL1025689)
Ki 12.59±n/a nM
Citation Barton, NPBellenie, BRDoran, ATEmmons, AJHeer, JPSalvagno, CM Discovery and optimisation of a potent and selective tertiary sulfonamide oxytocin antagonist. Bioorg Med Chem Lett19:528-32 (2008) 
 
Oxytocin receptor
Name:Oxytocin receptor
Type:Enzyme Catalytic Domain
Mol. Mass.:42793.26
Organism:Homo sapiens (Human)
Description:Oxytocin OXTR HEK293::B2R9L7
Residue:389
BDBM50413723
NameBDBM50413723
Synonyms:CHEMBL458872
TypeSmall organic molecule
Emp. Form.C26H25N3O5S2
Mol. Mass.523.624
SMILESCOc1ccc(cn1)N(Cc1ccc(cn1)-c1ccccc1C)S(=O)(=O)c1cccc(c1)S(C)(=O)=O