Reaction Details
TargetCannabinoid receptor 1
LigandBDBM50200841
Substrate/Competitorn/a
Meas. Tech.ChEMBL_500314 (CHEMBL973406)
IC50 0.302±n/a nM
Citation Kang, NSLee, GNYoo, SE Predictive models of Cannabinoid-1 receptor antagonists derived from diverse classes. Bioorg Med Chem Lett19:2990-6 (2009) 
 
Cannabinoid receptor 1
Name:Cannabinoid receptor 1
Type:G Protein-Coupled Receptor (GPCR)
Mol. Mass.:52868.96
Organism:Homo sapiens (Human)
Description:P21554
Residue:472
BDBM50200841
NameBDBM50200841
Synonyms:CHEMBL220360 MK-0634 N-[(1S,2S)-3-(4-chlorophenyl)-2-(3-cyanophenyl)-1-methylpropyl]-2-methyl-2-{[5-(trifluoromethyl)pyridin-2-yl]oxy}propanamide Taranbant
TypeSmall organic molecule
Emp. Form.C27H25ClF3N3O2
Mol. Mass.515.955
SMILESC[C@H](NC(=O)C(C)(C)Oc1ccc(cn1)C(F)(F)F)[C@@H](Cc1ccc(Cl)cc1)c1cccc(c1)C#N