Reaction Details
TargetCannabinoid receptor 1
LigandBDBM50161553
Substrate/Competitorn/a
Meas. Tech.ChEMBL_500314 (CHEMBL973406)
IC50 169.82±n/a nM
Citation Kang, NSLee, GNYoo, SE Predictive models of Cannabinoid-1 receptor antagonists derived from diverse classes. Bioorg Med Chem Lett19:2990-6 (2009) 
 
Cannabinoid receptor 1
Name:Cannabinoid receptor 1
Type:G Protein-Coupled Receptor (GPCR)
Mol. Mass.:52868.96
Organism:Homo sapiens (Human)
Description:P21554
Residue:472
BDBM50161553
NameBDBM50161553
Synonyms:5-(4-Chloro-phenyl)-4-(2,4-dichloro-phenyl)-1-methyl-1H-imidazole-2-carboxylic acid morpholin-4-ylamide CHEMBL181331
TypeSmall organic molecule
Emp. Form.C21H19Cl3N4O2
Mol. Mass.465.76
SMILESCn1c(nc(c1-c1ccc(Cl)cc1)-c1ccc(Cl)cc1Cl)C(=O)NN1CCOCC1