Reaction Details
TargetCannabinoid receptor 1
LigandBDBM50200844
Substrate/Competitorn/a
Meas. Tech.ChEMBL_500314 (CHEMBL973406)
IC50 1.12±n/a nM
Citation Kang, NSLee, GNYoo, SE Predictive models of Cannabinoid-1 receptor antagonists derived from diverse classes. Bioorg Med Chem Lett19:2990-6 (2009) 
 
Cannabinoid receptor 1
Name:Cannabinoid receptor 1
Type:G Protein-Coupled Receptor (GPCR)
Mol. Mass.:52868.96
Organism:Homo sapiens (Human)
Description:P21554
Residue:472
BDBM50200844
NameBDBM50200844
Synonyms:CHEMBL219480 N-[(1S,2S)-3-(4-chlorophenyl)-1-methyl-2-phenylpropyl]-2-(3,5-difluorophenyloxy)-2-methylpropanamide
TypeSmall organic molecule
Emp. Form.C26H26ClF2NO2
Mol. Mass.457.94
SMILESC[C@H](NC(=O)C(C)(C)Oc1cc(F)cc(F)c1)[C@@H](Cc1ccc(Cl)cc1)c1ccccc1