Reaction Details
TargetUrotensin-2 receptor
LigandBDBM50413772
Substrate/Competitorn/a
Meas. Tech.ChEMBL_523641 (CHEMBL998012)
EC50 72.44±n/a nM
Citation Grieco, PCarotenuto, ACampiglia, PGomez-Monterrey, IAuriemma, LSala, MMarcozzi, Cd'Emmanuele di Villa Bianca, RBrancaccio, DRovero, PSanticioli, PMeini, SMaggi, CANovellino, E New insight into the binding mode of peptide ligands at Urotensin-II receptor: structure-activity relationships study on P5U and urantide. J Med Chem52:3927-40 (2009) 
 
Urotensin-2 receptor
Name:Urotensin-2 receptor
Type:Enzyme Catalytic Domain
Mol. Mass.:42725.34
Organism:RAT
Description:Urotensin-II UTS2R RAT::P49684
Residue:386
BDBM50413772
NameBDBM50413772
Synonyms:CHEMBL508811
TypeSmall organic molecule
Emp. Form.C57H71N11O12S2
Mol. Mass.1166.37
SMILESCC(C)[C@H](NC(=O)[C@@H]1CSSC(C)(C)[C@@H](NC(=O)[C@@H](N)Cc2ccc(cc2)[N+]([O-])=O)C(=O)N[C@@H](Cc2ccccc2)C(=O)N[C@@H](Cc2c[nH]c3ccccc23)C(=O)N[C@@H](CCCCN)C(=O)N[C@@H](Cc2ccc(O)cc2)C(=O)N1)C(O)=O